{"text_format":"1","workbook":"xlsx","n_sheets":11,"sheets":["Início","2","FSA Micro <=10","FSA Micro >10","FSA Mini","MD","DU","Dados","Fim","Modelos","config"],"not_rendered":{"charts":0,"images":13,"macros":1,"external_links":0,"defined_names":9,"comments":0,"pivot_tables":0},"unopened":[],"bounds":{"document_bytes":16777216,"sheet_cells":100000,"rows_first":2000,"rows_last":500,"rows_between":2000,"halvings":0,"cell_chars":16384,"cell_head_chars":4096},"cells_cut":0,"cells_raw":0,"read":"whole","date_system":"1900"}

{"sheet":"Início","index":0,"n_rows":25,"n_cols":7,"rows_kept":25,"cut":false,"hidden":false,"merged":[[9,1,12,9],[14,1,21,9],[2,6,7,10],[24,6,24,8]]}
[]
[]
[null,null,null,null,null,null,"Projeto Modelo de Micro e Minigeração Distribuída 1.6"]
[]
[]
[]
[]
[]
[]
[null,"Olá,\nseja bem-vindo(a)!"]
[]
[]
[]
[]
[null,{"$f":"\"Essa é uma ferramenta criada pela Neoenergia para facilitar a submissão do projeto de geração distribuída e melhorar a experiência do cliente.\" &\n\"\nNavegue pelos formulários a seguir preenchendo com as informações solicitadas.\nAo final, os arquivos em PDF serão criados e salvos automaticamente.\n\nSimples e rápido.\"","v":"Essa é uma ferramenta criada pela Neoenergia para facilitar a submissão do projeto de geração distribuída e melhorar a experiência do cliente.\nNavegue pelos formulários a seguir preenchendo com as informações solicitadas.\nAo final, os arquivos em PDF serão criados e salvos automaticamente.\n\nSimples e rápido."}]
[]
[]
[]
[]
[]
[]
[]
[]
[null,"Pronto(a) para iniciar o preenchimento?"]
[null,null,null,null,null,null,"Neoenergia Distribuição Brasília"]

{"sheet":"2","index":1,"n_rows":9,"n_cols":2,"rows_kept":9,"cut":false,"hidden":false,"merged":[[8,1,10,9],[12,1,14,9]]}
[]
[]
[]
[]
[]
[]
[]
[]
[null,"Selecione o tipo de formulário de solicitação de acesso:"]

{"sheet":"FSA Micro <=10","index":2,"n_rows":86,"n_cols":15,"rows_kept":86,"cut":false,"hidden":false,"merged":[[0,0,0,9],[1,0,1,9],[2,0,2,9],[4,0,4,9],[5,0,5,1],[5,2,5,5],[5,6,5,7],[5,8,5,9],[6,0,6,1],[6,2,6,9],[7,0,7,1],[7,2,7,5],[8,1,8,3],[8,5,8,9],[9,1,9,4],[9,5,9,8],[10,1,10,2],[10,5,10,8],[11,0,11,1],[11,2,11,4],[11,5,11,8],[12,0,12,9],[13,0,13,2],[13,4,13,7],[13,8,13,9],[14,0,14,1],[14,2,14,3],[15,0,15,1],[15,6,15,7],[16,0,16,9],[17,0,17,3],[17,4,17,5],[17,8,17,9],[25,0,25,9],[26,0,27,9],[28,0,28,9],[18,0,18,2],[18,4,18,5],[18,8,18,9],[19,0,19,9],[20,0,20,9],[35,1,35,2],[34,0,34,2],[34,3,34,9],[35,5,35,9],[15,2,15,3],[15,4,15,5],[29,0,29,9],[30,0,30,2],[31,0,31,1],[32,1,32,3],[21,0,21,9],[32,5,32,9],[33,0,33,9],[22,0,22,9],[23,0,23,9],[24,0,24,9]]}
["FORMULÁRIO DE SOLICITAÇÃO DE ACESSO"]
["MICROGERAÇÃO DISTRIBUÍDA"]
["POTÊNCIA INFERIOR A 10 KW"]
[]
["1 - Identificação da Unidade Consumidora (UC)"]
[" Código da UC:",null,754619,null,null,null,"Classe:",null,"Industrial"]
[" Titular da UC:",null,"WWF - Brasil"]
[" Logradouro:",null,"CLS 114 Bloco D Loja 35",null,null,null,"Nº:",3,"CEP:",70377540]
[" Bairro:","Asa Sul",null,null,"Cidade:","Brasília"]
[" E-mail:","relacionamento@wwf.org.br"]
[" Fone:",6136860632,null,null,"Celular:",61000000000]
[" CPF/CNPJ:",null,26990192000114]
["2 - Dados da Unidade Consumidora"]
[" Carga instalada (kW):",null,null,70,"Tensão de fase-neutro (V):",null,null,null,220]
[" Tipo conexão:",null,"Trifásico"]
[" Tipo ramal:",null,"Subterrâneo"]
["3 - Dados da Geração"]
[" Potência instalada de geração (em kW):",null,null,null,{"$f":"MD!Q97","v":20}]
[" Tipo da fonte de geração:",null,null,"Solar"]
["4 - Documentação a ser anexada"]
[" 1. ART do Responsável Técnico pelo projeto elétrico e instalação do sistema de microgeração"]
[" 2. Projeto elétrico das instalações de conexão, memorial descritivo"]
[" 3. Diagrama unifilar contemplando Geração/Proteção (inversor, se for o caso)/ Medição e memorial descritivo da instalação"]
[" 4. Certificado de conformidade do(s) inversor(es) ou número de registro da concessão do Inmetro do(s) inversor(es) para a tensão nominal de conexão com a rede"]
[" 5. Dados necessários para registro da central geradora conforme disponível no site da ANNEL: www.annel.gov.br/scg"]
[" 6. Lista de unidades consumidoras participantes do sistema de compensação (se houver) indicando a porcentagem de rateio dos créditos e o enquadramento conforme incisos VI a VIII do art. 2° da Resolução Normativa n° 482/2012."]
[" 7. Cópia de instrumento jurídico que comprove o compromisso de solidariedade entre os integrantes (se houver)"]
[]
[" 8. Documento que comprove o reconhecimento, pela ANEEL, da cogeração qualificada (se houver)."]
["5 - Contato na Distribuidora"]
{"$rows_left_out":57}
{"sheet":"FSA Micro >10","index":3,"n_rows":36,"n_cols":10,"rows_kept":36,"cut":false,"hidden":false,"merged":[[25,0,25,9],[26,0,27,9],[34,0,34,2],[34,3,34,9],[28,0,28,9],[35,1,35,3],[35,5,35,9],[29,0,29,9],[30,0,30,2],[31,0,31,1],[32,1,32,3],[32,5,32,9],[33,0,33,9],[21,0,21,9],[22,0,22,9],[23,0,23,9],[24,0,24,9],[15,0,15,1],[15,2,15,3],[16,0,16,9],[17,0,17,3],[17,4,17,5],[18,0,18,2],[19,0,19,9],[20,0,20,9],[12,0,12,9],[13,0,13,2],[13,4,13,7],[13,8,13,9],[14,0,14,1],[14,2,14,3],[9,1,9,4],[9,5,9,8],[10,1,10,2],[10,5,10,8],[11,0,11,1],[11,2,11,4],[11,5,11,8],[6,0,6,1],[6,2,6,9],[7,0,7,1],[7,2,7,5],[8,1,8,3],[8,5,8,9],[0,0,0,9],[1,0,1,9],[2,0,2,9],[4,0,4,9],[5,0,5,1],[5,2,5,5],[5,6,5,7],[5,8,5,9]]}
["FORMULÁRIO DE SOLICITAÇÃO DE ACESSO"]
["MICROGERAÇÃO DISTRIBUÍDA"]
["POTÊNCIA SUPERIOR A 10 KW"]
[]
["1 - Identificação da Unidade Consumidora (UC)"]
[" Código da UC:",null,1037321,null,null,null,"Classe:",null,"Poder Público"]
[" Titular da UC:",null,"IBRAM - Instituto do Meio Ambiente e dos Recursos Hídricos do DF"]
[" Logradouro:",null,"QE 23 Lote E Sede Parque Ez. Heig",null,null,null,"Nº:",1,"CEP:",71025020]
[" Bairro:","Guará",null,null,"Cidade:","Brasília"]
[" E-mail:","gefsema@sema.df.gov.br"]
[" Fone:",61993601387,null,null,"Celular:",61999775763]
[" CPF/CNPJ:",null,8915353000123]
["2 - Dados da Unidade Consumidora"]
[" Carga instalada (kW):",null,null,29.7,"Tensão de fase-neutro (V):",null,null,null,220]
[" Tipo conexão:",null,"Trifásico"]
[" Tipo ramal:",null,"Aéreo"]
["3 - Dados da Geração"]
[" Potência instalada de geração (em kW):",null,null,null,{"$f":"MD!Q97","v":20}]
[" Tipo da fonte de geração:",null,null,"Solar"]
["4 - Documentação a ser anexada"]
[" 1. ART do Responsável Técnico pelo projeto elétrico e instalação do sistema de microgeração"]
[" 2. Projeto elétrico das instalações de conexão, memorial descritivo"]
[" 3. Diagrama unifilar contemplando Geração/Proteção (inversor, se for o caso)/ Medição e memorial  descritivo da instalação"]
["4. Certificado de conformidade do(s) inversor(es) ou número de registro da concessão do Inmetro do(s) inversor(es) para a tensão nominal de conexão com a rede"]
[" 5. Dados necessários para registro da central geradora conforme disponível no site da ANNEL: www.annel.gov.br/scg"]
[" 6. Lista de unidades consumidoras participantes do sistema de compensação (se houver) indicando a porcentagem de rateio dos créditos e o enquadramento conforme incisos VI a VIII do art. 2° da Resolução Normativa n° 482/2012."]
[" 7. Cópia de instrumento jurídico que comprove o compromisso de solidariedade entre os integrantes (se houver)"]
[]
[" 8. Documento que comprove o reconhecimento, pela ANNEL, da cogeração qualificada (se houver). "]
["5 - Contato na Distribuidora"]
{"$rows_left_out":7}
{"sheet":"FSA Mini","index":4,"n_rows":40,"n_cols":12,"rows_kept":40,"cut":false,"hidden":false,"merged":[[38,0,38,2],[38,3,38,9],[39,1,39,3],[39,5,39,9],[33,0,33,9],[34,0,34,2],[35,0,35,1],[36,1,36,3],[36,5,36,9],[37,0,37,9],[21,0,21,3],[21,4,21,5],[15,0,15,2],[15,6,15,7],[15,8,15,9],[16,0,16,2],[17,0,17,3],[17,4,17,9],[21,8,21,9],[18,0,18,3],[18,4,18,9],[19,0,19,1],[19,2,19,3],[20,0,20,9],[32,0,32,9],[22,0,22,2],[22,4,22,5],[22,8,22,9],[23,0,23,9],[24,0,24,9],[25,0,25,9],[26,0,26,9],[27,0,27,9],[28,0,28,9],[29,0,29,9],[30,0,31,9],[12,0,12,9],[13,0,13,2],[13,4,13,7],[13,8,13,9],[14,0,14,1],[14,2,14,3],[9,1,9,4],[9,5,9,8],[10,1,10,2],[10,5,10,8],[11,0,11,1],[11,2,11,4],[11,5,11,8],[6,0,6,1],[6,2,6,9],[7,0,7,1],[7,2,7,5],[8,1,8,3],[8,5,8,9],[0,0,0,9],[1,0,1,9],[2,0,2,9],[4,0,4,9],[5,0,5,1],[5,2,5,5],[5,6,5,7],[5,8,5,9]]}
["FORMULÁRIO DE SOLICITAÇÃO DE ACESSO"]
["MINIGERAÇÃO DISTRIBUÍDA"]
[]
[]
["1 - Identificação da Unidade Consumidora (UC)"]
[" Código da UC:",null,null,null,null,null,"Classe:"]
[" Titular da UC:"]
[" Logradouro:",null,null,null,null,null,"Nº:",null,"CEP:"]
[" Bairro:",null,null,null,"Cidade:"]
[" E-mail:"]
[" Fone:",null,null,null,"Celular:"]
[" CPF/CNPJ:"]
["2 - Dados da Unidade Consumidora"]
[" Carga instalada (kW):",null,null,null,"Tensão de fase-neutro (V):",null,null,null,null,null,null,1]
[" Tipo conexão:"]
["Transformador particular:"]
["Tipo de instalação:"]
["Tipo de ligação do transformador:"]
["Impedância percentual do transformador:"]
[" Tipo ramal:"]
["3 - Dados da Geração"]
[" Potência instalada de geração (em kW):",null,null,null,{"$f":"MD!Q97","v":20}]
[" Tipo da fonte de geração:"]
["4 - Documentação a ser anexada"]
[" 1. ART do Responsável Técnico pelo projeto elétrico e instalação do sistema de microgeração"]
[" 2. Projeto elétrico das instalações de conexão, memorial descritivo"]
[" 3. Diagrama unifilar contemplando Geração/Proteção (inversor, se for o caso)/ Medição e memorial descritivo da instalação"]
[" 4. Certificado de conformidade do(s) inversor(es) ou número de registro da concessão do Inmetro do(s) inversor(es) para a tensão nominal de conexão com a rede"]
[" 5. Dados necessários para registro da central geradora conforme disponível no site da  ANEEL: www.annel.gov.br/scg"]
[" 6. Lista de unidades consumidoras participantes do sistema de compensação (se houver) indicando a porcentagem de rateio dos créditos e o enquadramento conforme incisos VI a VIII do art. 2° da Resolução Normativa n° 482/2012."]
{"$rows_left_out":11}
{"sheet":"MD","index":5,"n_rows":162,"n_cols":17,"rows_kept":162,"cut":false,"hidden":false,"merged":[[109,16,109,17],[99,1,99,6],[100,1,100,6],[101,1,101,6],[102,1,102,6],[106,1,106,6],[107,1,107,6],[108,1,108,6],[109,1,109,6],[102,7,102,8],[107,16,107,17],[108,16,108,17],[101,11,101,12],[104,1,104,6],[105,1,105,6],[106,7,106,8],[103,11,103,12],[104,11,104,12],[105,11,105,12],[106,11,106,12],[107,11,107,12],[105,9,105,10],[109,9,109,10],[106,9,106,10],[73,13,76,13],[99,7,99,8],[100,7,100,8],[101,7,101,8],[101,9,101,10],[78,7,78,8],[75,10,75,11],[102,9,102,10],[104,7,104,8],[73,7,73,8],[96,7,96,12],[97,11,97,12],[80,10,80,11],[73,10,73,11],[75,7,75,8],[97,7,97,8],[74,7,74,8],[98,9,98,10],[98,7,98,8],[54,9,56,9],[98,11,98,12],[100,11,100,12],[97,9,97,10],[99,11,99,12],[98,1,98,6],[100,9,100,10],[99,9,99,10],[60,3,60,5],[61,3,61,5],[62,3,62,5],[66,3,66,5],[64,3,64,5],[78,10,78,11],[76,7,76,8],[67,7,67,8],[82,10,82,11],[81,10,81,11],[81,7,81,8],[82,7,82,8],[89,1,94,12],[77,10,77,11],[76,10,76,11],[69,1,69,11],[49,2,50,11],[54,2,56,2],[53,1,53,11],[45,1,45,12],[52,1,52,11],[59,3,59,5],[35,1,35,2],[35,9,35,10],[71,6,73,6],[71,3,73,3],[71,7,71,12],[72,7,72,9],[54,6,56,6],[67,3,67,5],[37,4,37,7],[38,4,38,7],[57,3,57,5],[54,8,56,8],[54,7,56,7],[63,3,63,5],[58,3,58,5],[54,1,56,1],[54,3,56,5],[65,3,65,5],[0,1,4,3],[41,1,42,13],[37,1,37,2],[38,1,38,2],[8,1,8,13],[29,1,29,12],[35,7,35,8],[35,3,35,6],[10,2,10,7],[10,8,10,11],[1,6,1,13],[2,6,2,13],[3,6,3,13],[4,6,4,13],[5,1,5,12],[38,8,38,9],[11,2,11,7],[11,8,11,11],[34,1,34,2],[13,2,13,12],[34,9,34,10],[34,3,34,6],[14,2,27,12],[34,7,34,8],[148,1,148,7],[145,1,146,12],[139,1,142,12],[134,1,136,12],[149,1,151,12],[129,1,131,12],[161,3,161,12],[125,3,125,7],[126,3,126,7],[127,3,127,7],[127,8,127,10],[125,8,125,10],[126,8,126,10],[133,1,133,7],[138,1,138,7],[144,1,144,7],[124,3,124,7],[124,8,124,10],[108,7,108,8],[109,7,109,8],[110,1,110,6],[120,1,122,12],[119,1,119,7],[111,1,114,12],[117,1,117,12],[108,11,108,12],[105,7,105,8],[109,11,109,12],[104,9,104,10],[107,9,107,10],[107,7,107,8],[108,9,108,10],[84,3,84,5],[96,1,97,6],[71,4,73,4],[71,5,73,5],[71,2,73,2],[79,7,79,8],[80,7,80,8],[103,1,103,6],[77,7,77,8],[83,10,83,11],[74,10,74,11],[83,7,83,8],[79,10,79,11],[71,1,73,1],[102,11,102,12],[103,9,103,10],[103,7,103,8],[72,10,72,12]]}
[]
[]
[]
[]
[]
[null,"MEMORIAL DESCRITIVO DE GERAÇÃO DISTRIBUÍDA"]
[null,null,null,null,null,null,null,null,null,null,null,null,null,null,"FSA Micro >10",null,"FSA Micro <=10"]
[]
[null,"1. LOCALIZAÇÃO DA UNIDADE CONSUMIDORA"]
[]
[null,null,"Latitude",null,null,null,null,null,"Longitude",null,null,null,"PG"]
[]
[null,null,"RUA NOVA PERIMETRAL, 285, VIDA NOVA"]
[null,null,"Captura de tela evidenciando localização do empreendimento da unidade consumidora solicitante"]
[null,null,59147190]
[]
[]
[]
[]
[]
[]
[]
[]
[]
[]
[]
[]
[]
[null,null,null,84994001777]
[null,"1. CARACTERÍSTICAS DA UNIDADE CONSUMIDORA"]
{"$rows_left_out":133}
{"sheet":"DU","index":6,"n_rows":31,"n_cols":11,"rows_kept":31,"cut":false,"hidden":false,"merged":[[0,2,2,6],[23,7,24,10],[22,4,22,7],[23,5,23,6],[20,0,20,1],[24,0,24,2],[11,6,12,8],[4,10,4,11],[10,10,10,11],[23,0,23,2],[21,0,21,1],[29,6,29,8],[27,0,27,2],[30,0,30,2],[25,0,25,2],[26,0,26,2],[28,0,28,2],[29,0,29,2],[30,6,30,8],[28,5,28,8]]}
[null,null,"Rede de distribuição de 220 V"]
[]
[]
[]
[null,null,null,null,null,null,null,null,null,null,"Acessada"]
[]
[]
[]
[null,null,null,null,"Disjuntor de entrada"]
[null,null,null,null,{"$f":"MD!$B$39&\" A\"","v":"50 A"}]
[null,null,null,null,null,null,null,null,null,null,"Acessante"]
[null,null,null,null,null,null,"Padrão de entrada"]
[]
[]
[]
[]
[]
[]
[]
[]
["Proteção CA"]
[{"$f":"IF(A25=\"Múltiplos inversores\",\"Múltiplos inversores\",MD!M75&\" A\")","v":"40 A"}]
[null,null,null,null,"Proteção CC"]
["Inversor(es)",null,null,null,null,{"$f":"IF(A25=\"Múltiplos inversores\",\"Múltiplos inversores\",MD!J75&\" A\")","v":"15 A"},null,"Cargas"]
[{"$f":"IF(COUNTA(MD!C75:C84)>1,\"Múltiplos inversores\",MD!C75)","v":"SYMO 20.0-3-M"}]
[{"$f":"IF(COUNTA(MD!C75:C84)>1,\"\",MD!D75)","v":"Fronius "}]
[]
[]
[null,null,null,null,null,"Sistema de geração com",null,null,null,{"$f":"IF(COUNTA(MD!C58:C67)>1,\"Múltiplos modelos\",MD!H58)","v":50}]
[null,null,null,null,null,null,"módulos da marca",null,null,{"$f":"IF(G30=\"módulos da marca\",MD!D58,\"\")","v":"Canadian Solar"}]
{"$rows_left_out":2}
{"sheet":"Dados","index":7,"n_rows":108,"n_cols":15,"rows_kept":108,"cut":false,"hidden":false,"merged":[[79,0,79,2],[71,0,71,3],[71,4,71,7],[73,3,73,7],[73,0,73,2],[75,0,75,2],[77,0,77,2],[77,3,77,8],[60,0,60,2],[62,0,62,2],[46,0,46,2],[48,0,48,2],[50,0,50,2],[52,0,52,2],[54,0,54,2],[56,0,56,2],[58,0,58,2],[48,3,48,8],[56,3,56,8],[54,3,54,8],[46,3,46,8],[24,3,24,7],[26,3,26,9],[28,3,28,7],[30,3,30,7],[34,2,34,9],[36,2,36,7],[38,2,38,3],[42,0,42,2],[44,0,44,2],[12,2,12,9],[14,2,14,3],[6,3,6,7],[10,3,10,8],[0,3,2,9],[6,1,6,2],[8,1,8,2],[10,0,10,2],[4,0,4,9]]}
[null,null,null,"Dados que deverão ser encaminhados à Distribuidora para registro da unidade consumidora no sistema de compensação de energia regido pela REN 482, de 17 de abril de 2012."]
[]
[]
[]
[{"$f":"\"   CENTRAL GERADORA \"&IF(K5=\"Solar\",\"SOLAR FOTOVOLTAICA:\",IF(K5=\"Eólica\",\"EÓLICA\",\"\"))","v":"   CENTRAL GERADORA SOLAR FOTOVOLTAICA:"},null,null,null,null,null,null,null,null,null,"Solar"]
[]
["Modalidade:","Geração na própria UC",null,"Quantidade UCs que recebem os créditos:",null,null,null,null,1]
[]
["Classe:","Poder Público",null,"Subgrupo:",{"$f":"IF(B9=\"Residencial\",\"B1\",IF(OR(B9=\"Comercial\",B9=\"Industrial\",B9=\"Poder Público\",B9=\"Iluminação pública\",B9=\"Serviço Público\"),\"B3\",IF(B9=\"Rural\",\"B2\",\"\")))","v":"B3"}]
[]
["Município/UF da UC com GD:",null,null,"Brasília"]
[]
["Endereço da UC com GD:",null,"QE 23 Lote E Sede Parque Ez. Heig, 1, Guará"]
[]
["CEP da UC com GD:",null,71025020]
[]
["Coordenadas geodésicas (SIRGAS2000) da localização da usina em Grau, Minuto e Segundo:"]
[]
[null,null,"Grau º","Minuto '","Segundo ''"]
[null,"Latitude  ",15,50,7]
[null,"Longitude  ",47,58,10]
[]
["   TITULAR:"]
[]
["CPF/CNPJ do Titular da UC com GD:",null,null,8915353000123]
[]
["Nome do Titular da UC com GD:",null,null,"IBRAM - Instituto do Meio Ambiente e dos Recursos Hídricos do DF"]
[]
["Telefone do Titular (DDD + número):",null,null,61999775763]
[]
{"$rows_left_out":79}
{"sheet":"Fim","index":8,"n_rows":16,"n_cols":2,"rows_kept":16,"cut":false,"hidden":false,"merged":[[15,1,18,8],[3,7,4,10],[5,1,12,8]]}
[]
[]
[]
[]
[]
[null,"Pronto!"]
[]
[]
[]
[]
[]
[]
[]
[]
[]
[null,"Clique em finalizar para salvar tudo ou em voltar para rever os documentos"]

{"sheet":"Modelos","index":9,"n_rows":930,"n_cols":5,"rows_kept":930,"cut":false,"hidden":false,"merged":[[1,1,1,2]]}
[]
[null,"Use o filtro ou CTRL+L para pesquisar os inversores"]
[]
[null,"FABRICANTE","MODELO","POTÊNCIA"]
[null,"ABB","PRO-33.0-TL-OUTD-400",33,{"$f":"B5","v":"ABB"}]
[null,"ABB","PRO-33.0-TL-OUTD-S400",33,"ABB"]
[null,"ABB","PRO-33.0-TL-OUTD-SX400",33,"ABB"]
[null,"ABB","PVI 10.0-TL-OUTD",11,"ABB"]
[null,"ABB","PVI 10.0-TL-OUTD-FS",11,"ABB"]
[null,"ABB","PVI 10.0-TL-OUTD-S",11,"ABB"]
[null,"ABB","PVI 12.5-TL-OUTD",6,"ABB"]
[null,"ABB","PVI 12.5-TL-OUTD-FS",13.8,"ABB"]
[null,"ABB","PVI 12.5-TL-OUTD-S ",13.8,"ABB"]
[null,"ABB","PVI 3.0-TL-OUTD",3,"ABB"]
[null,"ABB","PVI 3.0-TL-OUTD-S",3,"ABB"]
[null,"ABB","PVI 3.6-TL-OUTD",3.6,"ABB"]
[null,"ABB","PVI 3.8-TL-OUTD",3.8,"ABB"]
[null,"ABB","PVI 4.2-TL-OUTD",4.2,"ABB"]
[null,"ABB","PVI 4.6-TL-OUTD",4.5999999999999996,"ABB"]
[null,"ABB","PVI 5000-TL-OUTD",10,"ABB"]
[null,"ABB","PVI 6000-TL-OUTD",12.11,"ABB"]
[null,"ABB","PVI-3.0-TL-OUTD-S",3,"ABB"]
[null,"ABB","PVI-3.6-TL-OUTD-S",3.6,"ABB"]
[null,"ABB","PVI-4.2-TL-OUTD-S",4.2,"ABB"]
[null,"ABB","PVI-5000-TL-OUTD-S",5,"ABB"]
[null,"ABB","PVI-55.0",55,"ABB"]
[null,"ABB","PVI-6000-TL-OUTD-S",6,"ABB"]
[null,"ABB","TRIO 5.8-TL-OUTD",5.8,"ABB"]
[null,"ABB","TRIO 7.5-TL-OUTD",7.5,"ABB"]
[null,"ABB","TRIO 8.5-TL-OUTD",8.5,"ABB"]
{"$rows_left_out":901}
{"sheet":"config","index":10,"n_rows":515,"n_cols":14,"rows_kept":515,"cut":false,"hidden":true,"merged":[[6,4,6,5],[12,4,12,5],[12,6,15,7],[16,4,16,5]]}
["Residencial","Solar","Monofásico",220,"Aéreo",null,"Horária Verde",null,null,"FABRICANTE","FABRICANTE","MODELO","POTÊNCIA"]
["Rural","Eólica","Bifásico","127 / 220","Subterrâneo",null,"Horária Azul",null,1,"ABB","NEP","BDM-300X2-EU-D",null,{"$f":"K2","v":"NEP"}]
["Comercial","Biomassa","Trifásico","220 / 380",null,null,"Optante B",null,2,"ABB ","SERRANA","Blank 3000 26 Z",null,"SERRANA"]
["Industrial","Cogeração qualificada","Média tensão",13800,null,null,null,null,3,"AFORE","SERRANA","BLANK 5000 26 Z",null,"SERRANA"]
["Poder Público",null,"Alta tensão",69000,null,null,null,null,4,"APSYSTEMS","SAJ SOLAR INVERTER ","BLS 4K",null,"SAJ SOLAR INVERTER "]
["A4",null,null,null,null,null,null,null,5,"B&B Power","SAJ SOLAR INVERTER ","BLS 5K",null,"SAJ SOLAR INVERTER "]
[null,null,null,null,"Validação dos inversores",null,null,null,6,"B&B Power ","AFORE","BNT027KTL","500 kW","AFORE"]
["Qtd cel preenchidas FSA","Qtd cel preenchidas MD",null,null,"Inversor 1",null,null,null,7,"CANADIAN SOLAR","Serrana ","Cabernet 30000 27 L",null,"Serrana "]
[{"$f":"COUNTA('FSA Micro <=10'!C6:F6,'FSA Micro <=10'!C7:J7,'FSA Micro <=10'!I6:J6,'FSA Micro <=10'!C8:F8,'FSA Micro <=10'!H8,'FSA Micro <=10'!J8,'FSA Micro <=10'!B9:D9,'FSA Micro <=10'!F9:J9,'FSA Micro <=10'!B10:E10,'FSA Micro <=10'!B11:C11,'FSA Micro <=10'!F11:I11,'FSA Micro <=10'!C12:E12,'FSA Micro <=10'!D14,'FSA Micro <=10'!I14:J14,'FSA Micro <=10'!C16:D16,'FSA Micro <=10'!D19,'FSA Micro <=10'!D35:J35,'FSA Micro <=10'!B36:C36,'FSA Micro <=10'!F36:J36)","v":19},{"$f":"COUNTA(MD!B39:J39,MD!C58:K58,MD!C75,MD!E75,MD!F75,MD!H75,MD!K75)","v":15},"Lista?",null,"Inversor 2",null,null,null,8,"Canadian Solar Inc","Serrana","Cabernet 40000 32 L",null,"Serrana"]
[{"$f":"COUNTA('FSA Micro >10'!C6:F6,'FSA Micro >10'!I6:J6,'FSA Micro >10'!C7:J7,'FSA Micro >10'!C8:F8,'FSA Micro >10'!H8,'FSA Micro >10'!J8,'FSA Micro >10'!B9:D9,'FSA Micro >10'!F9:J9,'FSA Micro >10'!B10:E10,'FSA Micro >10'!B11:C11,'FSA Micro >10'!F11:I11,'FSA Micro >10'!C12:E12,'FSA Micro >10'!D14,'FSA Micro >10'!I14:J14,'FSA Micro >10'!C16:D16,'FSA Micro >10'!D19,'FSA Micro >10'!D35:J35,'FSA Micro >10'!B36:D36,'FSA Micro >10'!F36:J36)","v":19},null,"Não",null,"Inversor 3",null,null,null,9,"Chint Power ","Serrana ","Cabernet 40000 32 L",null,"Serrana "]
[{"$f":"COUNTA('FSA Mini'!C6:F6,'FSA Mini'!I6:J6,'FSA Mini'!C7:J7,'FSA Mini'!C8:F8,'FSA Mini'!H8,'FSA Mini'!J8,'FSA Mini'!B9:D9,'FSA Mini'!F9:J9,'FSA Mini'!B10:E10,'FSA Mini'!B11:C11,'FSA Mini'!F11:I11,'FSA Mini'!C12:E12,'FSA Mini'!D14,'FSA Mini'!I14:J14,'FSA Mini'!E18:J18,'FSA Mini'!E19:J19,'FSA Mini'!C20:D20,'FSA Mini'!D23,'FSA Mini'!D39:J39,'FSA Mini'!B40:D40,'FSA Mini'!F40:J40,'FSA Mini'!C15:D15)","v":0},"Qtd cel preenchidas Dados",null,null,null,"Aprova",null,null,10,"CR2 MAXX","Schneider Electric ","Conext CL 20000E",null,"Schneider Electric "]
[null,{"$f":"COUNTA(Dados!B7,Dados!I7,Dados!B9,Dados!E9,Dados!D11,Dados!C13,Dados!C15,Dados!C20,Dados!D20,Dados!E20,Dados!C21,Dados!D21,Dados!E21,Dados!D25,Dados!D27,Dados!D29,Dados!D31,Dados!C35,Dados!C37,Dados!C39,Dados!D43,Dados!D45,Dados!D47,Dados!D49,Dados!D51,Dados!D53,Dados!D55,Dados!D57,Dados!D59)","v":29},"Tarifa branca?",null,null,null,null,null,11,"Duraluxe","Schneider Electric ","Conext CL 25000E",null,"Schneider Electric "]
[null,null,"Não",null,"Validação do formulário",null,"Se minigeração, reprova",null,12,"EAST","SCHNEIDER","Conext RL 3000E",null,"SCHNEIDER"]
["Selecione a empresa para identificação do FSA",null,null,null,"Caracterização",{"$f":"IF(MD!Q7=\"FSA Mini\",\"Reprova\",\"Aprova\")","v":"Aprova"},null,null,13,"EcoSolys","SCHNEIDER","Conext RL 5000E",null,"SCHNEIDER"]
["Coelba",null,null,null,null,null,null,null,14,"EDGE","Chint Power ","CPS SCA 12KTL","50 kW","Chint Power "]
[null,null,null,null,null,null,null,null,15,"FRONIUS","Chint Power ","CPS SCA 20KTL","60 kW","Chint Power "]
[null,null,null,null,null,null,null,null,16,"Fronius ","Chint Power ","CPS SCA 25KTL","500 kW","Chint Power "]
["Elektro","Elektro Redes S A / Central de Relacionamento com Clientes","Rua Ary Antenor de Souza, 321, Jardim Nova América, Campinas/SP","0800 020 1200 ","projeto.particular@elektro.com.br",null,null,null,17,"GINLONG","CANADIAN SOLAR","CSI1.5K-TL","33 kW","CANADIAN SOLAR"]
["Cosern","Unidade de Relacionamento com Grandes Clientes","Rua Mermoz, 150, Cidade Alta, Natal/RN","0800 084 5010","gd.cosern@neoenergia.com",null,null,null,18,"Ginlong ","Canadian Solar Inc","CSI-1.5K-TL","20 kW","Canadian Solar Inc"]
["Coelba","Unidade de Relacionamento com Poder Público e Novos Clientes","Av. Edgar Santos, 300, Narandiba, Salvador/BA","0800 071 5509","captacaodeclientes.coelba@neoenergia.com.br",null,null,null,19,"GOODWE","Canadian Solar","CSI-15KTL-GI-FL","2,5 kW","Canadian Solar"]
["Celpe","Unidade de Relacionamento com Clientes Privados","Av. João de Barros, 111, Boa Vista, Recife/PE","0800 031 1866","clientescorporativoscelpe@neoenergia.com",null,null,null,20,"Gree Eletric ","Canadian Solar","CSI-15KTL-GI-LFL","3,3 kW","Canadian Solar"]
["Neoenergia Distribuição Brasília","Gerência de Grandes Clientes","SIA Área Especial Lote C, Guará, Distrito Federal","(61) 3465-9110","grandesclientes@ceb.com.br",null,null,null,21,"GROWATT","CANADIAN SOLAR","CSI-20K-GI-FL","3,68 kW","CANADIAN SOLAR"]
[null,null,null,null,null,null,null,null,22,"Guangdong ","Canadian Solar","CSI-20KTL-GI-FL","3,8 kW","Canadian Solar"]
[null,"Comentário do projetista",null,"Barramento coletivo?","Autotrafo?",null,null,null,23,"HOYMILES","Canadian Solar","CSI-20KTL-GI-LFL","3 kW","Canadian Solar"]
[null,"Ao preencher esse projeto, percebi um problema na hora de informar a seção transversal no memorial descritivo e, consequentemente, do diagra",null,"Não","Não",null,null,null,24,"HUAWEI","CANADIAN SOLAR","CSI-25K-GI-FL","4,6 kW","CANADIAN SOLAR"]
[null,null,null,null,null,null,null,null,25,"Huawei ","Canadian Solar","CSI-25KTL-GI-FL","5 kW","Canadian Solar"]
[null,null,null,null,null,null,null,null,26,"Hummer Dynamo ","CANADIAN SOLAR","CSI-30K-GI-FL","6 kW","CANADIAN SOLAR"]
[null,null,null,null,null,null,null,null,27,"INGETEAM","Canadian Solar","CSI-30KTL-GI-FL","12 kW","Canadian Solar"]
[null,null,null,null,null,null,null,null,28,"INGETEAM POWER ","Canadian Solar","CSI-30KTL-GI-L","20 kW","Canadian Solar"]
[null,null,null,null,null,null,null,null,29,"INTELBRAS","Canadian Solar Inc","CSI-3K-TL","30 kW","Canadian Solar Inc"]
{"$rows_left_out":485}